{"text_format":"1","workbook":"xlsx","n_sheets":5,"sheets":["Manuel d'utilisation","Diagnostic","Résultats globaux","Résultats par chapitre","Liste"],"not_rendered":{"charts":8,"images":2,"macros":1,"external_links":0,"defined_names":7,"comments":0,"pivot_tables":8},"unopened":[],"bounds":{"document_bytes":16777216,"sheet_cells":100000,"rows_first":2000,"rows_last":500,"rows_between":2000,"halvings":0,"cell_chars":16384,"cell_head_chars":4096},"cells_cut":0,"cells_raw":0,"read":"whole","date_system":"1900"}

{"sheet":"Manuel d'utilisation","index":0,"n_rows":5,"n_cols":14,"rows_kept":5,"cut":false,"hidden":false,"merged":[[4,0,4,10],[4,13,4,15]]}
[]
[]
[]
[]
["Grille d'autoévaluation selon la norme ISO 9001 : 2015",null,null,null,null,null,null,null,null,null,null,null,null,"Sommaire dynamique"]

{"sheet":"Diagnostic","index":1,"n_rows":158,"n_cols":10,"rows_kept":158,"cut":false,"hidden":false,"merged":[[4,0,4,9],[6,0,6,1],[8,0,8,1],[10,0,10,1],[6,6,6,9],[8,6,8,9],[10,6,10,9],[136,0,148,0],[136,1,140,1],[141,1,144,1],[145,1,148,1],[149,0,157,0],[150,1,156,1],[94,0,135,0],[94,1,100,1],[101,1,109,1],[110,1,121,1],[122,1,126,1],[127,1,130,1],[131,1,132,1],[133,1,135,1],[53,0,65,0],[63,1,65,1],[57,1,62,1],[53,1,56,1],[66,0,93,0],[66,1,78,1],[79,1,83,1],[84,1,86,1],[88,1,93,1],[31,1,41,1],[31,0,52,0],[42,1,48,1],[49,1,52,1],[13,0,30,0],[13,1,15,1],[16,1,18,1],[21,1,30,1],[19,1,20,1]]}
[]
[]
[]
[]
["Grille d'autoévaluation selon la norme ISO 9001 : 2015"]
[]
["Organisme évalué :"]
[]
["Evaluateur :"]
[]
["Date évaluation :"]
[]
["Chapitre","Article","Chapitre","Article","Chapitre de la norme correspondant\nVersion 2015","Ancien chapitre version 2008","Questions","Evaluation","Observations","Note"]
["Chap. 4 Contexte de l'organisme","4.1 Compréhension de l'organisme et de son contexte","Chap. 4 Contexte de l'organisme","4.1 Compréhension de l'organisme et de son contexte",null,"-","Les enjeux internes et externes relatifs à l'entreprise sont-ils identifiés ?",null,null,{"$f":"IFERROR(VLOOKUP(Tableau1[[#This Row],[Evaluation]],Liste!$A$1:$B$5,2,FALSE),\"A compléter\")","v":"A compléter"}]
[null,null,"Chap. 4 Contexte de l'organisme","4.1 Compréhension de l'organisme et de son contexte",null,"-","Les informations relatives à ces enjeux internes et externes sont-ils surveillés ?",null,null,{"$f":"IFERROR(VLOOKUP(Tableau1[[#This Row],[Evaluation]],Liste!$A$1:$B$5,2,FALSE),\"A compléter\")","v":"A compléter"}]
[null,null,"Chap. 4 Contexte de l'organisme","4.1 Compréhension de l'organisme et de son contexte",null,"-","Ces enjeux sont-ils pris en compte dans le système qualité ?",null,null,{"$f":"IFERROR(VLOOKUP(Tableau1[[#This Row],[Evaluation]],Liste!$A$1:$B$5,2,FALSE),\"A compléter\")","v":"A compléter"}]
[null,"4.2 Compréhension des besoins et attentes des parties intéressées","Chap. 4 Contexte de l'organisme","4.2 Compréhension des besoins et attentes des parties intéressées",null,"-","Les parties intéressées pertinentes sont-elles identifiées ?",null,null,{"$f":"IFERROR(VLOOKUP(Tableau1[[#This Row],[Evaluation]],Liste!$A$1:$B$5,2,FALSE),\"A compléter\")","v":"A compléter"}]
[null,null,"Chap. 4 Contexte de l'organisme","4.2 Compréhension des besoins et attentes des parties intéressées",null,"-","Les exigences des parties intéressées sont-elles identifiées ?",null,null,{"$f":"IFERROR(VLOOKUP(Tableau1[[#This Row],[Evaluation]],Liste!$A$1:$B$5,2,FALSE),\"A compléter\")","v":"A compléter"}]
[null,null,"Chap. 4 Contexte de l'organisme","4.2 Compréhension des besoins et attentes des parties intéressées",null,"-","Les exigences des parties intéressées sont-elles surveillées et revues ?",null,null,{"$f":"IFERROR(VLOOKUP(Tableau1[[#This Row],[Evaluation]],Liste!$A$1:$B$5,2,FALSE),\"A compléter\")","v":"A compléter"}]
[null,"4.3 Détermination du domaine d'application du système de management de la qualité","Chap. 4 Contexte de l'organisme","4.3 Détermination du domaine d'application du système de management de la qualité",null,"1.2","Le domaine d'application du SMQ est-il déterminé ?",null,null,{"$f":"IFERROR(VLOOKUP(Tableau1[[#This Row],[Evaluation]],Liste!$A$1:$B$5,2,FALSE),\"A compléter\")","v":"A compléter"}]
[null,null,"Chap. 4 Contexte de l'organisme","4.3 Détermination du domaine d'application du système de management de la qualité",null,"1.2","Le domaine d'application est-il disponible sous une forme documentée ?",null,null,{"$f":"IFERROR(VLOOKUP(Tableau1[[#This Row],[Evaluation]],Liste!$A$1:$B$5,2,FALSE),\"A compléter\")","v":"A compléter"}]
[null,"4.4 SMQ et ses processus","Chap. 4 Contexte de l'organisme","4.4 SMQ et ses processus",null,"1.2","Les processus ont-ils été identifiés ?",null,null,{"$f":"IFERROR(VLOOKUP(Tableau1[[#This Row],[Evaluation]],Liste!$A$1:$B$5,2,FALSE),\"A compléter\")","v":"A compléter"}]
[null,null,"Chap. 4 Contexte de l'organisme","4.4 SMQ et ses processus",null,"1.2","Les données d'entrées et de sorties de ces processus ont-elles été identifiées ?",null,null,{"$f":"IFERROR(VLOOKUP(Tableau1[[#This Row],[Evaluation]],Liste!$A$1:$B$5,2,FALSE),\"A compléter\")","v":"A compléter"}]
[null,null,"Chap. 4 Contexte de l'organisme","4.4 SMQ et ses processus",null,"1.2","Les séquences et les interactions de ces processus ont-elles été identifiées ?",null,null,{"$f":"IFERROR(VLOOKUP(Tableau1[[#This Row],[Evaluation]],Liste!$A$1:$B$5,2,FALSE),\"A compléter\")","v":"A compléter"}]
[null,null,"Chap. 4 Contexte de l'organisme","4.4 SMQ et ses processus",null,"1.2","Les critères et les méthodes pour assurer l'efficacité de ces processus ont-ils été déterminé ?",null,null,{"$f":"IFERROR(VLOOKUP(Tableau1[[#This Row],[Evaluation]],Liste!$A$1:$B$5,2,FALSE),\"A compléter\")","v":"A compléter"}]
[null,null,"Chap. 4 Contexte de l'organisme","4.4 SMQ et ses processus",null,"1.2","Les ressources nécessaires à ces processus sont-elles identifiées et à disposition ?",null,null,{"$f":"IFERROR(VLOOKUP(Tableau1[[#This Row],[Evaluation]],Liste!$A$1:$B$5,2,FALSE),\"A compléter\")","v":"A compléter"}]
[null,null,"Chap. 4 Contexte de l'organisme","4.4 SMQ et ses processus",null,"1.2","Les responsabilités ont-elles été définies ?",null,null,{"$f":"IFERROR(VLOOKUP(Tableau1[[#This Row],[Evaluation]],Liste!$A$1:$B$5,2,FALSE),\"A compléter\")","v":"A compléter"}]
[null,null,"Chap. 4 Contexte de l'organisme","4.4 SMQ et ses processus",null,"1.2","Les risques et opportunités liés à ces processus ont été pris en compte, des actions appropriées sont planifiées ?",null,null,{"$f":"IFERROR(VLOOKUP(Tableau1[[#This Row],[Evaluation]],Liste!$A$1:$B$5,2,FALSE),\"A compléter\")","v":"A compléter"}]
[null,null,"Chap. 4 Contexte de l'organisme","4.4 SMQ et ses processus",null,"1.2","Ces processus sont évalués, mesurés et analysés ? ",null,null,{"$f":"IFERROR(VLOOKUP(Tableau1[[#This Row],[Evaluation]],Liste!$A$1:$B$5,2,FALSE),\"A compléter\")","v":"A compléter"}]
[null,null,"Chap. 4 Contexte de l'organisme","4.4 SMQ et ses processus",null,"1.2","Des actions sont mises en œuvre si les processus ne produisent pas les résultats attendus ?",null,null,{"$f":"IFERROR(VLOOKUP(Tableau1[[#This Row],[Evaluation]],Liste!$A$1:$B$5,2,FALSE),\"A compléter\")","v":"A compléter"}]
[null,null,"Chap. 4 Contexte de l'organisme","4.4 SMQ et ses processus",null,"1.2","Les informations relatives à ces processus sont documentées?",null,null,{"$f":"IFERROR(VLOOKUP(Tableau1[[#This Row],[Evaluation]],Liste!$A$1:$B$5,2,FALSE),\"A compléter\")","v":"A compléter"}]
["Chap. 5 Leadership","5.1 Leadership et engagement","Chap. 5 Leadership","5.1 Leadership et engagement","5.1.1 Généralités","5.1","La direction assume et démontre sa responsabilité et son engagement dans l'efficacité du SMQ ?",null,null,{"$f":"IFERROR(VLOOKUP(Tableau1[[#This Row],[Evaluation]],Liste!$A$1:$B$5,2,FALSE),\"A compléter\")","v":"A compléter"}]
[null,null,"Chap. 5 Leadership","5.1 Leadership et engagement","5.1.1 Généralités","5.1","La politique et les objectifs qualité sont-ils établis et formalisés ?",null,null,{"$f":"IFERROR(VLOOKUP(Tableau1[[#This Row],[Evaluation]],Liste!$A$1:$B$5,2,FALSE),\"A compléter\")","v":"A compléter"}]
[null,null,"Chap. 5 Leadership","5.1 Leadership et engagement","5.1.1 Généralités","5.1","La direction promouvoit-elle l'approche processus et l'approche par les risques ?",null,null,{"$f":"IFERROR(VLOOKUP(Tableau1[[#This Row],[Evaluation]],Liste!$A$1:$B$5,2,FALSE),\"A compléter\")","v":"A compléter"}]
[null,null,"Chap. 5 Leadership","5.1 Leadership et engagement","5.1.1 Généralités","5.1","La direction s'assure-t-elle de la disponibilité des ressources nécessaires au SMQ?",null,null,{"$f":"IFERROR(VLOOKUP(Tableau1[[#This Row],[Evaluation]],Liste!$A$1:$B$5,2,FALSE),\"A compléter\")","v":"A compléter"}]
[null,null,"Chap. 5 Leadership","5.1 Leadership et engagement","5.1.1 Généralités","5.1","La direction communique t-elle sur l'importance de disposer un système efficace et de se conformer aux exigences  et incite-elle les personnes à contribuer à son efficacité ?",null,null,{"$f":"IFERROR(VLOOKUP(Tableau1[[#This Row],[Evaluation]],Liste!$A$1:$B$5,2,FALSE),\"A compléter\")","v":"A compléter"}]
[null,null,"Chap. 5 Leadership","5.1 Leadership et engagement","5.1.1 Généralités","5.1","La direction s'assure-t-elle que le SMQ atteint les résultats attendus?",null,null,{"$f":"IFERROR(VLOOKUP(Tableau1[[#This Row],[Evaluation]],Liste!$A$1:$B$5,2,FALSE),\"A compléter\")","v":"A compléter"}]
[null,null,"Chap. 5 Leadership","5.1 Leadership et engagement","5.1.1 Généralités","5.1","La direction promouvoit-elle l'amélioration ?",null,null,{"$f":"IFERROR(VLOOKUP(Tableau1[[#This Row],[Evaluation]],Liste!$A$1:$B$5,2,FALSE),\"A compléter\")","v":"A compléter"}]
[null,null,"Chap. 5 Leadership","5.1 Leadership et engagement","5.1.1 Généralités","5.1","La direction soutient-elle les autres personnes ayant un rôle pertinent dans le système, afin de démonter leurs responsabilités ?",null,null,{"$f":"IFERROR(VLOOKUP(Tableau1[[#This Row],[Evaluation]],Liste!$A$1:$B$5,2,FALSE),\"A compléter\")","v":"A compléter"}]
[null,null,"Chap. 5 Leadership","5.1 Leadership et engagement","5.1.2 Orientation client","5.2","La direction démontre t-elle son engagement relatif à l'engagement client ?",null,null,{"$f":"IFERROR(VLOOKUP(Tableau1[[#This Row],[Evaluation]],Liste!$A$1:$B$5,2,FALSE),\"A compléter\")","v":"A compléter"}]
[null,null,"Chap. 5 Leadership","5.1 Leadership et engagement","5.1.2 Orientation client","5.2","Les exigences des clients sont-elles déterminées et respectées ?",null,null,{"$f":"IFERROR(VLOOKUP(Tableau1[[#This Row],[Evaluation]],Liste!$A$1:$B$5,2,FALSE),\"A compléter\")","v":"A compléter"}]
[null,null,"Chap. 5 Leadership","5.1 Leadership et engagement","5.1.2 Orientation client","5.2","Les risques et opportunités ayant une incidence sur la conformité des produits et services sont-ils déterminés et pris en compte ?",null,null,{"$f":"IFERROR(VLOOKUP(Tableau1[[#This Row],[Evaluation]],Liste!$A$1:$B$5,2,FALSE),\"A compléter\")","v":"A compléter"}]
[null,"5.2 Politique","Chap. 5 Leadership","5.2 Politique",null,"5.3","La politique qualité est-elle adaptée à la finalité de l'organisme ?",null,null,{"$f":"IFERROR(VLOOKUP(Tableau1[[#This Row],[Evaluation]],Liste!$A$1:$B$5,2,FALSE),\"A compléter\")","v":"A compléter"}]
[null,null,"Chap. 5 Leadership","5.2 Politique",null,"5.3","La politique est-elle établit, revue et mise à jour régulièrement par la direction ?",null,null,{"$f":"IFERROR(VLOOKUP(Tableau1[[#This Row],[Evaluation]],Liste!$A$1:$B$5,2,FALSE),\"A compléter\")","v":"A compléter"}]
[null,null,"Chap. 5 Leadership","5.2 Politique",null,"5.3","La politique qualité prend-t-elle en compte les exigences réglementaires, légales et celles des clients?",null,null,{"$f":"IFERROR(VLOOKUP(Tableau1[[#This Row],[Evaluation]],Liste!$A$1:$B$5,2,FALSE),\"A compléter\")","v":"A compléter"}]
[null,null,"Chap. 5 Leadership","5.2 Politique",null,"5.3","La politique qualité définit-elle un cadre aux objectifs qualité ?",null,null,{"$f":"IFERROR(VLOOKUP(Tableau1[[#This Row],[Evaluation]],Liste!$A$1:$B$5,2,FALSE),\"A compléter\")","v":"A compléter"}]
[null,null,"Chap. 5 Leadership","5.2 Politique",null,"5.3","La politique qualité comprend-elle l'engagement à satisfaire aux exigences et à améliorer en permanence l'efficacité du SMQ ?",null,null,{"$f":"IFERROR(VLOOKUP(Tableau1[[#This Row],[Evaluation]],Liste!$A$1:$B$5,2,FALSE),\"A compléter\")","v":"A compléter"}]
[null,null,"Chap. 5 Leadership","5.2 Politique",null,"5.3","La politique qualité est-elle communiquée au sein de l'organisme ?",null,null,{"$f":"IFERROR(VLOOKUP(Tableau1[[#This Row],[Evaluation]],Liste!$A$1:$B$5,2,FALSE),\"A compléter\")","v":"A compléter"}]
[null,null,"Chap. 5 Leadership","5.2 Politique",null,"5.3","La politique qualité est-elle mise à disposition des parties intéressées ?",null,null,{"$f":"IFERROR(VLOOKUP(Tableau1[[#This Row],[Evaluation]],Liste!$A$1:$B$5,2,FALSE),\"A compléter\")","v":"A compléter"}]
[null,"5.3 Rôles, responsabilités et autorités au sein de l'organisme","Chap. 5 Leadership","5.3 Rôles, responsabilités et autorités au sein de l'organisme",null,"5.5","Les responsabilités et autorités de tous les individus de votre organisme sont-elles clairement formalisées et communiquées au sein de l'organisme ?",null,null,{"$f":"IFERROR(VLOOKUP(Tableau1[[#This Row],[Evaluation]],Liste!$A$1:$B$5,2,FALSE),\"A compléter\")","v":"A compléter"}]
[null,null,"Chap. 5 Leadership","5.3 Rôles, responsabilités et autorités au sein de l'organisme",null,"5.5","Un responsable a-t-il été nommé par la direction pour rendre compte de la performance du SMQ et des opportunités d'amélioration à la direction ?",null,null,{"$f":"IFERROR(VLOOKUP(Tableau1[[#This Row],[Evaluation]],Liste!$A$1:$B$5,2,FALSE),\"A compléter\")","v":"A compléter"}]
[null,null,"Chap. 5 Leadership","5.3 Rôles, responsabilités et autorités au sein de l'organisme",null,"5.5","Un responsable a-t-il été nommé par la direction pour assurer la sensibilisation aux exigences du client et promovoir l'orientation client dans tout l'organisme ?",null,null,{"$f":"IFERROR(VLOOKUP(Tableau1[[#This Row],[Evaluation]],Liste!$A$1:$B$5,2,FALSE),\"A compléter\")","v":"A compléter"}]
[null,null,"Chap. 5 Leadership","5.3 Rôles, responsabilités et autorités au sein de l'organisme",null,"5.5","Un responsable a-t-il été nommé par la direction pour assurer suivi du SMQ ?",null,null,{"$f":"IFERROR(VLOOKUP(Tableau1[[#This Row],[Evaluation]],Liste!$A$1:$B$5,2,FALSE),\"A compléter\")","v":"A compléter"}]
["Chap. 6 Planification","6.1 Actions à mettre en œuvre face aux risques et opportunités","Chap. 6 Planification","6.1 Actions à mettre en œuvre face aux risques et opportunités",null,"5.4.2 / 8.3","Les risques et opportunités pour votre organisme sont-ils déterminés ?",null,null,{"$f":"IFERROR(VLOOKUP(Tableau1[[#This Row],[Evaluation]],Liste!$A$1:$B$5,2,FALSE),\"A compléter\")","v":"A compléter"}]
[null,null,"Chap. 6 Planification","6.1 Actions à mettre en œuvre face aux risques et opportunités",null,"5.4.2 / 8.3","La planification du SMQ prend elle en compte les risques et opportunités ?",null,null,{"$f":"IFERROR(VLOOKUP(Tableau1[[#This Row],[Evaluation]],Liste!$A$1:$B$5,2,FALSE),\"A compléter\")","v":"A compléter"}]
[null,null,"Chap. 6 Planification","6.1 Actions à mettre en œuvre face aux risques et opportunités",null,"5.4.2 / 8.3","Des actions sont-elles mises en œuvre face aux risques et opportunités ?",null,null,{"$f":"IFERROR(VLOOKUP(Tableau1[[#This Row],[Evaluation]],Liste!$A$1:$B$5,2,FALSE),\"A compléter\")","v":"A compléter"}]
[null,null,"Chap. 6 Planification","6.1 Actions à mettre en œuvre face aux risques et opportunités",null,"5.4.2 / 8.3","L'efficacité de ces actions est-elle mesurée ?",null,null,{"$f":"IFERROR(VLOOKUP(Tableau1[[#This Row],[Evaluation]],Liste!$A$1:$B$5,2,FALSE),\"A compléter\")","v":"A compléter"}]
[null,"6.2 Objectifs qualité et planification des actions pour les atteindre","Chap. 6 Planification","6.2 Objectifs qualité et planification des actions pour les atteindre",null,"5.4.1 / 5.4.2","Vos objectifs qualité sont-ils en adéquation permanente avec la politique qualité de l'organisme? ",null,null,{"$f":"IFERROR(VLOOKUP(Tableau1[[#This Row],[Evaluation]],Liste!$A$1:$B$5,2,FALSE),\"A compléter\")","v":"A compléter"}]
[null,null,"Chap. 6 Planification","6.2 Objectifs qualité et planification des actions pour les atteindre",null,"5.4.1 / 5.4.2","Vos objectifs qualité sont-ils adaptés à la finalité de l'organisme?",null,null,{"$f":"IFERROR(VLOOKUP(Tableau1[[#This Row],[Evaluation]],Liste!$A$1:$B$5,2,FALSE),\"A compléter\")","v":"A compléter"}]
[null,null,"Chap. 6 Planification","6.2 Objectifs qualité et planification des actions pour les atteindre",null,"5.4.1 / 5.4.2","Vos objectifs qualité sont-ils mesurables ?",null,null,{"$f":"IFERROR(VLOOKUP(Tableau1[[#This Row],[Evaluation]],Liste!$A$1:$B$5,2,FALSE),\"A compléter\")","v":"A compléter"}]
{"$rows_left_out":99}
{"sheet":"Résultats globaux","index":2,"n_rows":15,"n_cols":2,"rows_kept":15,"cut":false,"hidden":false,"merged":[[4,0,4,2]]}
[]
[]
[]
[]
["Résultats globaux, autoévaluation ISO 9001 : 2015"]
[]
["Chapitre de la norme","Note (%)"]
["Chap. 4 Contexte de l'organisme",{"$error":"#DIV/0!"}]
["Chap. 5 Leadership",{"$error":"#DIV/0!"}]
["Chap. 6 Planification",{"$error":"#DIV/0!"}]
["Chap. 7 Support",{"$error":"#DIV/0!"}]
["Chap. 8 Réalisation des activités opérationnelles",{"$error":"#DIV/0!"}]
["Chap. 9 Evaluation des performances",{"$error":"#DIV/0!"}]
["Chap.10 Amélioration",{"$error":"#DIV/0!"}]
["Note générale",{"$error":"#DIV/0!"}]

{"sheet":"Résultats par chapitre","index":3,"n_rows":240,"n_cols":16,"rows_kept":240,"cut":false,"hidden":false,"merged":[[4,5,4,15],[120,14,121,14],[120,15,121,15],[152,11,153,13],[152,14,153,14],[152,15,153,15],[184,11,185,13],[184,14,185,14],[184,15,185,15],[56,11,57,13],[56,14,57,14],[56,15,57,15],[88,11,89,13],[88,14,89,14],[88,15,89,15],[120,11,121,13],[180,11,181,13],[180,14,181,14],[180,15,181,15],[182,11,183,13],[182,14,183,14],[182,15,183,15],[174,11,174,15],[175,11,175,13],[246,15,247,15],[238,11,238,15],[239,11,239,13],[240,11,241,13],[240,14,241,14],[240,15,241,15],[242,11,243,13],[242,14,243,14],[242,15,243,15],[244,11,245,13],[244,14,245,14],[244,15,245,15],[246,11,247,13],[246,14,247,14],[214,11,215,13],[214,14,215,14],[214,15,215,15],[220,5,220,15],[224,11,224,15],[225,11,236,15],[216,11,217,13],[216,14,217,14],[216,15,217,15],[210,11,211,13],[210,14,211,14],[210,15,211,15],[212,11,213,13],[212,14,213,14],[212,15,213,15],[188,5,188,15],[192,11,192,15],[193,11,204,15],[206,11,206,15],[207,11,207,13],[208,11,209,13],[208,14,209,14],[208,15,209,15],[176,11,177,13],[176,14,177,14],[176,15,177,15],[178,11,179,13],[178,14,179,14],[178,15,179,15],[150,11,151,13],[150,14,151,14],[150,15,151,15],[156,5,156,15],[160,11,160,15],[161,11,172,15],[146,11,147,13],[146,14,147,14],[146,15,147,15],[148,11,149,13],[148,14,149,14],[148,15,149,15],[124,5,124,15],[128,11,128,15],[129,11,140,15],[142,11,142,15],[143,11,143,13],[144,11,145,13],[144,14,145,14],[144,15,145,15],[118,11,119,13],[118,14,119,14],[118,15,119,15],[110,11,110,15],[111,11,111,13],[112,11,113,13],[112,14,113,14],[112,15,113,15],[114,11,115,13],[114,14,115,14],[114,15,115,15],[60,5,60,15],[64,11,64,15],[65,11,76,15],[78,11,78,15],[79,11,79,13],[80,11,81,13],[80,14,81,14],[80,15,81,15],[116,11,117,13],[116,14,117,14],[116,15,117,15],[86,11,87,13],[86,14,87,14],[86,15,87,15],[92,5,92,15],[96,11,96,15],[97,11,108,15],[82,11,83,13],[82,14,83,14],[82,15,83,15],[84,11,85,13],[84,14,85,14],[84,15,85,15],[28,5,28,15],[32,11,32,15],[47,11,47,13],[46,11,46,15],[52,15,53,15],[52,11,53,13],[52,14,53,14],[54,11,55,13],[54,14,55,14],[54,15,55,15],[33,11,44,15],[48,11,49,13],[48,14,49,14],[48,15,49,15],[50,11,51,13],[50,14,51,14],[50,15,51,15]]}
[]
[]
[]
[]
[null,null,null,null,null,"Résultats par chapitre autoévaluation ISO 9001 : 2015"]
[]
[]
[]
[null,null,null,null,null,null,"Chapitre 4 : Contexte de l'organisme",null,null,null,null,"Page 2"]
[]
[null,null,null,null,null,null,"Chapitre 5 : Leadership",null,null,null,null,"Page 3"]
[]
[null,null,null,null,null,null,"Chapitre 6 : Planification",null,null,null,null,"Page 4"]
[]
[null,null,null,null,null,null,"Chapitre 7 : Support",null,null,null,null,"Page 5"]
[]
[null,null,null,null,null,null,"Chapitre 8 : Réalisation des activités opérationnelles",null,null,null,null,"Page 6"]
[]
[null,null,null,null,null,null,"Chapitre 9 : Evaluation des performances",null,null,null,null,"Page 7"]
[]
[null,null,null,null,null,null,"Chapitre 10 : Amélioration",null,null,null,null,"Page 8"]
[]
[]
[]
[]
[]
[]
[]
[null,"Chapitre","Chap. 4 Contexte de l'organisme",null,null,"Chapitre 4 : Contexte de l'organisme"]
[]
[null,"Chapitre de la norme","Note (%)",null,null,"Taux de conformité :",null,{"$f":"GETPIVOTDATA(\"Note\",$B$31)","v":{"$error":"#DIV/0!"}},{"$f":"IF(H31<33%,\"Non-conforme\",IF(H31<66%,\"A améliorer\",IF(H31<100%,\"Acceptable\",IF(H31=100%,\"Conforme\",\"\"))))","v":{"$error":"#DIV/0!"}}]
[null,"4.1 Compréhension de l'organisme et de son contexte",{"$error":"#DIV/0!"}]
[null,"4.4 SMQ et ses processus",{"$error":"#DIV/0!"},null,null,null,null,null,null,null,null,"Commentaires sur les résultats obtenus"]
[null,"4.2 Compréhension des besoins et attentes des parties intéressées",{"$error":"#DIV/0!"}]
[null,"4.3 Détermination du domaine d'application du système de management de la qualité",{"$error":"#DIV/0!"}]
[null,"Note générale",{"$error":"#DIV/0!"}]
[]
[]
[]
[]
[]
[]
[]
[]
[]
[]
[null,null,null,null,null,null,null,null,null,null,null,"Décisions/ Plans d'actions"]
[null,null,null,null,null,null,null,null,null,null,null,"Actions",null,null,"Pilote","Délais mise en œuvre"]
[]
[]
[]
[]
[]
[]
[]
[]
[]
[]
[]
[null,"Chapitre","Chap. 5 Leadership"]
{"$rows_left_out":181}
{"sheet":"Liste","index":4,"n_rows":5,"n_cols":3,"rows_kept":5,"cut":false,"hidden":true,"merged":[]}
["Non-conforme",0,"Non-conforme"]
["A améliorer",0.33,"A améliorer"]
["Acceptable",0.66,"Acceptable"]
["Conforme",1,"Conforme"]
["Exclus (NA)","NA"]